Bloom Ontology
type: Ontology
created: 2014-03-25
version info: 1.0
preferred namespace prefix: blm
comment: Bloom Ontology represents Bloom's taxonomy according to the classification model of the European Schoolnet (http://europeanschoolnet-vbe.lexaurus.net/vbe/browse#). We use also SKOS to integrate synonyms of each verb of Bloom. WordNet is selcted to be the reference of all synonyms. This ontology is developed within the framework of ILOT Project (Innovative Learning Object for Teaching) @en
version IRI: http://givingsense.eu/2013/ontologies/pedagogy/ontobloom.owl#0.0.1
creator: Jirasri Deslis
imports: skos-owl1-dl.rdf

Bloom Taxonomy
type: Class
comment: A global class for all Bloom's activities @en
comment: Une classe globale pour couvrir toutes les activités pédagogiques définies par Bloom
description: Bloom Ontology

extraire
type: Class
label: abstract @en
subclass of: résumer
scope note: http://wordnetweb.princeton.edu/perl/webwn
comment: Source de traduction : http://dictionnaire.reverso.net/anglais-francais/abstract
type: NamedIndividual
type: Concept

analyser
type: Class
label: analyse @en
subclass of: Bloom Taxonomy
scope note: http://wordnetweb.princeton.edu/perl/webwn
description: Breaking information into parts to explore understandings and relationships @en
example: analyze a sonnet by Shakespeare @en
definition: consider in detail and subject to an analysis in order to discover essential features or meaning @en
type: NamedIndividual
type: Concept
broad match: attribuer
broad match: différencier
broad match: organiser

appliquer
type: Class
label: apply @en
subclass of: Bloom Taxonomy
scope note: http://wordnetweb.princeton.edu/perl/webwn
description: Using information in another familiar situation @en
definition: put into service; make work or employ for a particular purpose or for its inherent or natural purpose @en
type: NamedIndividual
type: Concept

arranger
type: Class
label: arrange @en
subclass of: organiser
scope note: http://wordnetweb.princeton.edu/perl/webwn
type: NamedIndividual
type: Concept

faire un bilan
type: Class
label: assess @en
subclass of: évaluer
scope note: http://wordnetweb.princeton.edu/perl/webwn
comment: Source de traduction : http://dictionnaire.reverso.net/anglais-francais/assess Le choix de "faire un blian" pour la traduction de "assess" est pour éviter d'utiliser le mot "évaluer". En effet, il y a déjà la classe "evaluate" dont le label en français est "évaluer".
preferred label: faire un blian
type: NamedIndividual
type: Concept

conclure
type: Class
label: conclude @en
subclass of: faire un bilan
scope note: http://wordnetweb.princeton.edu/perl/webwn
definition: decide by reasoning; draw or come to a conclusion @en

associer
type: Class
label: associate @en
subclass of: comparer
scope note: http://wordnetweb.princeton.edu/perl/webwn
type: NamedIndividual
type: Concept

attribuer
type: Class
label: attribute @en
subclass of: analyser
scope note: http://wordnetweb.princeton.edu/perl/webwn
type: NamedIndividual
type: Concept

calculer
type: Class
label: calculate @en
subclass of: résoudre
scope note: http://wordnetweb.princeton.edu/perl/webwn
type: NamedIndividual
type: Concept

réaliser
type: Class
label: carry out @en
subclass of: expérimenter
scope note: http://wordnetweb.princeton.edu/perl/webwn
type: NamedIndividual
type: Concept

catégoriser
type: Class
label: categorise @en
subclass of: classifier
scope note: http://wordnetweb.princeton.edu/perl/webwn
comment: source de traduction : http://dictionnaire.reverso.net/francais-anglais/cat%C3%A9goriser
type: NamedIndividual

vérifier
type: Class
label: check @en
subclass of: évaluer
scope note: http://wordnetweb.princeton.edu/perl/webwn
definition: examine so as to determine accuracy, quality, or condition @en
type: NamedIndividual
type: Concept

clarifier
type: Class
label: clarifying @en
subclass of: interpréter
scope note: http://wordnetweb.princeton.edu/perl/webwn
type: NamedIndividual
type: Concept

classifier
type: Class
label: classify @en
subclass of: comprendre
scope note: http://wordnetweb.princeton.edu/perl/webwn
comment: Source de traduciton : http://dictionnaire.reverso.net/anglais-francais/classify
type: NamedIndividual

combiner
type: Class
label: combine
subclass of: produire
scope note: http://wordnetweb.princeton.edu/perl/webwn
type: NamedIndividual
type: Concept

distinguer
type: Class
label: distinguish @en
subclass of: comparer
scope note: http://wordnetweb.princeton.edu/perl/webwn
example: We distinguish several kinds of maple. @en

comparer
type: Class
label: compare @en
subclass of: comprendre
scope note: http://wordnetweb.princeton.edu/perl/webwn
type: NamedIndividual

composer
type: Class
label: compose @en
subclass of: produire
type: NamedIndividual
type: Concept

construire
type: Class
label: construct @en
subclass of: produire
scope note: http://wordnetweb.princeton.edu/perl/webwn
type: NamedIndividual
type: Concept

contraster
type: Class
label: contrast @en
subclass of: comparer
scope note: http://wordnetweb.princeton.edu/perl/webwn
type: NamedIndividual
type: Concept

créer
type: Class
label: create @en
subclass of: Bloom Taxonomy
scope note: http://wordnetweb.princeton.edu/perl/webwn#c
description: Generating new ideas, products, or ways of viewing things @en
definition: create or manufacture a man-made product @en
type: NamedIndividual
type: Concept

critiquer
type: Class
label: critique @en
subclass of: évaluer
scope note: http://wordnetweb.princeton.edu/perl/webwn
type: NamedIndividual
type: Concept

déconstruire
type: Class
label: deconstruct @en
subclass of: discriminer
scope note: http://wordnetweb.princeton.edu/perl/webwn#c
definition: interpret (a text or an artwork) by the method of deconstructing @en
type: NamedIndividual
type: Concept

décrire
type: Class
label: describe @en
subclass of: rappeler
scope note: http://wordnetweb.princeton.edu/perl/webwn
type: NamedIndividual
type: Concept

concevoir
type: Class
label: design @en
subclass of: planifier
type: NamedIndividual
type: Concept

detecter
type: Class
label: detect @en
subclass of: vérifier
scope note: http://wordnetweb.princeton.edu/perl/webwn
preferred label: détecter
type: NamedIndividual
type: Concept

distinguer
type: Class
label: distinguish @en
subclass of: différencier
scope note: http://wordnetweb.princeton.edu/perl/webwn
example: We distinguish several kinds of maple. @en

différencier
type: Class
label: differentiate @en
subclass of: analyser
scope note: http://wordnetweb.princeton.edu/perl/webwn#c
type: NamedIndividual
type: Concept

discriminer
type: Class
label: discriminate @en
subclass of: différencier
scope note: http://wordnetweb.princeton.edu/perl/webwn
definition: recognize or perceive the difference @en
preferred label: dicriminer
type: NamedIndividual
type: Concept

discuter
type: Class
label: discuss @en
subclass of: expliquer
scope note: http://wordnetweb.princeton.edu/perl/webwn
type: NamedIndividual
type: Concept

estimer
type: Class
label: estimate @en
subclass of: comparer
scope note: http://wordnetweb.princeton.edu/perl/webwn
type: NamedIndividual
type: Concept

évaluer
type: Class
label: evaluate @en
subclass of: Bloom Taxonomy
scope note: http://wordnetweb.princeton.edu/perl/webwn
description: Justifying a decision or course of action @en
type: NamedIndividual
type: Concept

exécuter
type: Class
label: execute @en
subclass of: appliquer
scope note: http://wordnetweb.princeton.edu/perl/webwn
type: NamedIndividual
type: Concept

exemplifier
type: Class
label: exemplify @en
subclass of: comprendre
scope note: http://wordnetweb.princeton.edu/perl/webwn
comment: source de traduction : http://dictionnaire.reverso.net/anglais-francais/exemplify
type: NamedIndividual

expérimenter
type: Class
label: experiment @en
subclass of: appliquer
scope note: http://wordnetweb.princeton.edu/perl/webwn
type: NamedIndividual
type: Concept

expliquer
type: Class
label: explain @en
subclass of: comprendre
scope note: http://wordnetweb.princeton.edu/perl/webwn
type: NamedIndividual

extrapoler
type: Class
label: extrapolate @en
subclass of: déduire
scope note: http://wordnetweb.princeton.edu/perl/webwn
type: NamedIndividual
type: Concept

trouver une cohérence
type: Class
label: find coherence @en
subclass of: organiser
type: NamedIndividual
type: Concept

focaliser
type: Class
label: focus @en
subclass of: différencier
scope note: http://wordnetweb.princeton.edu/perl/webwn
definition: bring into focus or alignment; to converge or cause to converge; of ideas or emotions @en
type: NamedIndividual
type: Concept

généraliser
type: Class
label: generalise @en
subclass of: résumer
scope note: http://wordnetweb.princeton.edu/perl/webwn
type: NamedIndividual
type: Concept

générer
type: Class
label: generate @en
subclass of: créer
scope note: http://wordnetweb.princeton.edu/perl/webwn
type: NamedIndividual
type: Concept

supposer
type: Class
label: hypothesise @en
subclass of: générer
scope note: http://wordnetweb.princeton.edu/perl/webwn
type: NamedIndividual
type: Concept

identifier
type: Class
label: identify @en
subclass of: reconnaître
scope note: http://wordnetweb.princeton.edu/perl/webwn
definition: recognize as being; establish the identity of someone or something @en
type: NamedIndividual
type: Concept

illustrer
type: Class
label: illustrate @en
subclass of: exemplifier
scope note: http://wordnetweb.princeton.edu/perl/webwn
type: NamedIndividual
type: Concept

implémenter
type: Class
label: implement @en
subclass of: appliquer
scope note: http://wordnetweb.princeton.edu/perl/webwn
type: NamedIndividual
type: Concept

déduire
type: Class
label: infer @en
subclass of: comprendre
scope note: http://wordnetweb.princeton.edu/perl/webwn
comment: source de traduction : http://dictionnaire.reverso.net/anglais-francais/infer
type: NamedIndividual

conclure
type: Class
label: conclude @en
subclass of: déduire
scope note: http://wordnetweb.princeton.edu/perl/webwn
definition: decide by reasoning; draw or come to a conclusion @en

instancier
type: Class
label: instantiate @en
subclass of: exemplifier
scope note: http://wordnetweb.princeton.edu/perl/webwn
type: NamedIndividual
type: Concept

intégrer
type: Class
label: integrate @en
subclass of: organiser
scope note: http://wordnetweb.princeton.edu/perl/webwn
type: NamedIndividual
type: Concept

interpoler
type: Class
label: interpolate @en
subclass of: déduire
scope note: http://wordnetweb.princeton.edu/perl/webwn
type: NamedIndividual
type: Concept

interpréter
type: Class
label: interpret @en
subclass of: comprendre
scope note: http://wordnetweb.princeton.edu/perl/webwn
comment: source de traduction : http://dictionnaire.reverso.net/anglais-francais/interpret
type: NamedIndividual

juger
type: Class
label: judge @en
subclass of: critiquer
scope note: http://wordnetweb.princeton.edu/perl/webwn
type: NamedIndividual
type: Concept

étiqueter
type: Class
label: label @en
subclass of: rappeler
type: NamedIndividual
type: Concept

énumérer
type: Class
label: list @en
subclass of: rappeler
scope note: http://wordnetweb.princeton.edu/perl/webwn
type: NamedIndividual
type: Concept

mapper
type: Class
label: map @en
subclass of: comparer
scope note: http://wordnetweb.princeton.edu/perl/webwn
comment: Source de traduction : 1. http://dictionnaire.reverso.net/anglais-francais/map 2. http://dictionnaire.reverso.net/francais-definition/mapper mapper v (informatique) établir une carte mémoire, une correspondance entre deux objets
type: NamedIndividual
type: Concept

assortir
type: Class
label: match @en
subclass of: comparer
scope note: http://wordnetweb.princeton.edu/perl/webwn
type: NamedIndividual
type: Concept

modifier
type: Class
label: modify @en
subclass of: appliquer
scope note: http://wordnetweb.princeton.edu/perl/webwn#c
type: NamedIndividual
type: Concept

surveiller
type: Class
label: monitor @en
subclass of: vérifier
scope note: http://wordnetweb.princeton.edu/perl/webwn
preferred label: contrôler
type: NamedIndividual
type: Concept

nommer
type: Class
label: name @en
subclass of: rappeler
type: NamedIndividual
type: Concept

organiser
type: Class
label: organise @en
subclass of: analyser
scope note: http://wordnetweb.princeton.edu/perl/webwn
definition: bring order and organization to @en
type: NamedIndividual
type: Concept

esquisser
type: Class
label: outline @en
subclass of: organiser
scope note: http://wordnetweb.princeton.edu/perl/webwn
preferred label: résumer
type: NamedIndividual
type: Concept

paraphraser
type: Class
label: paraphrase @en
subclass of: interpréter
scope note: http://wordnetweb.princeton.edu/perl/webwn
type: NamedIndividual
type: Concept

planifier
type: Class
label: plan @en
subclass of: créer
scope note: http://wordnetweb.princeton.edu/perl/webwn
type: NamedIndividual
type: Concept

prédire
type: Class
label: predict @en
subclass of: déduire
scope note: http://wordnetweb.princeton.edu/perl/webwn
type: NamedIndividual
type: Concept

produire
type: Class
label: produce @en
subclass of: créer
scope note: http://wordnetweb.princeton.edu/perl/webwn
type: NamedIndividual
type: Concept

citer
type: Class
label: quote
subclass of: rappeler
scope note: http://wordnetweb.princeton.edu/perl/webwn
type: NamedIndividual
type: Concept

rappeler
type: Class
label: recall @en
subclass of: mémoriser
scope note: http://wordnetweb.princeton.edu/perl/webwn
preferred label: se rappeler
type: NamedIndividual
type: Concept

réciter
type: Class
label: recite @en
subclass of: rappeler
scope note: http://wordnetweb.princeton.edu/perl/webwn
comment: restituer des informations qui ont été mémorisées
type: NamedIndividual
type: Concept

reconnaître
type: Class
label: recognise @en
subclass of: mémoriser
scope note: http://wordnetweb.princeton.edu/perl/webwn
type: NamedIndividual
type: Concept

recommender
type: Class
label: recommend @en
subclass of: faire un bilan
scope note: http://wordnetweb.princeton.edu/perl/webwn
preferred label: recommand @en
preferred label: recommander
type: NamedIndividual
type: Concept

mémoriser
type: Class
label: remember @en
subclass of: Bloom Taxonomy
scope note: http://wordnetweb.princeton.edu/perl/webwn
description: Recalling information @en
preferred label: remenber @en
type: NamedIndividual
type: Concept

représenter
type: Class
label: represent @en
subclass of: interpréter
scope note: http://wordnetweb.princeton.edu/perl/webwn
type: NamedIndividual
type: Concept

récupérer
type: Class
label: retrieve @en
subclass of: rappeler
type: NamedIndividual
type: Concept

sélectionner
type: Class
label: select @en
subclass of: différencier
scope note: http://wordnetweb.princeton.edu/perl/webwn
type: NamedIndividual
type: Concept

montrer
type: Class
label: show @en
subclass of: rappeler
scope note: http://wordnetweb.princeton.edu/perl/webwn
type: NamedIndividual
type: Concept

résoudre
type: Class
label: solve @en
subclass of: appliquer
scope note: http://wordnetweb.princeton.edu/perl/webwn
type: NamedIndividual
type: Concept

structurer
type: Class
label: structure @en
subclass of: organiser
scope note: http://wordnetweb.princeton.edu/perl/webwn
comment: source de traduction @en
type: NamedIndividual
type: Concept

subsumer
type: Class
label: subsume @en
subclass of: classifier
scope note: http://wordnetweb.princeton.edu/perl/webwn
type: NamedIndividual
type: Concept

résumer
type: Class
label: summarise @en
subclass of: comprendre
scope note: http://wordnetweb.princeton.edu/perl/webwn
comment: source de traduction : http://dictionnaire.reverso.net/anglais-francais/summarise
type: NamedIndividual

tester
type: Class
label: test
subclass of: vérifier
scope note: http://wordnetweb.princeton.edu/perl/webwn
type: NamedIndividual
type: Concept

traduire
type: Class
label: translate @en
subclass of: interpréter
scope note: http://wordnetweb.princeton.edu/perl/webwn
type: NamedIndividual
type: Concept

comprendre
type: Class
label: understand
subclass of: Bloom Taxonomy
scope note: http://wordnetweb.princeton.edu/perl/webwn
description: Explaining ideas or concepts @en
type: NamedIndividual
type: Concept

utiliser
type: Class
label: use @en
subclass of: implémenter
scope note: http://wordnetweb.princeton.edu/perl/webwn
type: NamedIndividual
type: Concept

Jean-Claude Moissinac
type: Class

accomplir
type: NamedIndividual
type: Concept
preferred label: accomplish @en

exécuter
type: NamedIndividual
type: Concept
preferred label: action @en
editorial note: Source de traduction : http://dictionnaire.reverso.net/anglais-francais/action

ébaucher
type: NamedIndividual
type: Concept
preferred label: adumbrate @en
scope note: Source de traduction : http://www.larousse.fr/dictionnaires/anglais-francais/adumbrate/561284

recommander
type: NamedIndividual
type: Concept
preferred label: advocate @en
editorial note: Source de traduction : http://dictionnaire.reverso.net/anglais-francais/advocate

s'accorder
type: NamedIndividual
type: Concept
preferred label: agree @en

changer
type: NamedIndividual
type: Concept
preferred label: alter @en
editorial note: source de traduction : http://dictionnaire.reverso.net/anglais-francais/alter

anticipater
type: NamedIndividual
type: Concept
preferred label: anticipate @en

évaluer
type: NamedIndividual
type: Concept
preferred label: appraise @en
editorial note: Source de traduction : http://dictionnaire.reverso.net/anglais-francais/appraise

se rapprocher
type: NamedIndividual
type: Concept
preferred label: approximate @en
editorial note: Source de traduction : http://dictionnaire.reverso.net/anglais-francais/approximate

assigner
type: NamedIndividual
type: Concept
example: The biologist assigned the mushroom to the proper class. @en
preferred label: assign @en
definition: decide as to where something belongs in a scheme @en

ranger
type: NamedIndividual
type: Concept
comment: souce de traduction : http://dictionnaire.reverso.net/anglais-francais/assort
preferred label: assort @en

mélanger
type: NamedIndividual
type: Concept
preferred label: blend @en

construire
type: NamedIndividual
type: Concept
preferred label: build @en

annoncer
type: NamedIndividual
type: Concept
editorial note: Source de traduction : http://dictionnaire.reverso.net/anglais-francais/call @en
preferred label: call @en

rappeler
type: NamedIndividual
type: Concept
preferred label: call back @en

canvass
type: NamedIndividual
type: Concept
editorial note: Nous ne trouvons pas le mot correspondant pour la traduction en français dans le contexte pédagogique.

réaliser
type: NamedIndividual
type: Concept
preferred label: carry through @en

catégoriser
type: NamedIndividual
type: Concept
preferred label: categorize @en

changer
type: NamedIndividual
type: Concept
preferred label: change @en

vérifier
type: NamedIndividual
type: Concept
preferred label: check @en
editorial note: Source de traduction : http://dictionnaire.reverso.net/anglais-francais/check

vérifier
type: NamedIndividual
type: Concept
preferred label: check into @en

vérifier
type: NamedIndividual
type: Concept
preferred label: check out @en
editorial note: Source de traduction : http://dictionnaire.reverso.net/anglais-francais/check%20out

vérifier
type: NamedIndividual
type: Concept
preferred label: check over @en

vérifier
type: NamedIndividual
type: Concept
preferred label: check up on @en
editorial note: Source de traduction : http://dictionnaire.reverso.net/anglais-francais/check%20up%20on

choisir
type: NamedIndividual
type: Concept
preferred label: choose @en

citer
type: NamedIndividual
type: Concept
preferred label: cite @en

classer
type: NamedIndividual
type: Concept
preferred label: class @en

éclaircir
type: NamedIndividual
type: Concept
preferred label: clear up @en

s'unir
type: NamedIndividual
type: Concept
preferred label: coalesce @en
editorial note: Source de traduction : http://dictionnaire.reverso.net/anglais-francais/coalesce

colliger
type: NamedIndividual
type: Concept
preferred label: colligate @en

mélanger
type: NamedIndividual
type: Concept
preferred label: commingle @en
editorial note: Source de traduction : http://dictionnaire.reverso.net/anglais-francais/commingle

concentrer
type: NamedIndividual
type: Concept
preferred label: concentre @en

concentrer
type: NamedIndividual
type: Concept
preferred label: concentre @en

réunir
type: NamedIndividual
type: Concept
preferred label: conflate @en
editorial note: source de traduction : http://dictionnaire.reverso.net/anglais-francais/conflate

conjecture
type: NamedIndividual
type: Concept
editorial note: Source de traduction : http://dictionnaire.reverso.net/francais-anglais/conjecture
preferred label: conjecturer @pt

connecter
type: NamedIndividual
type: Concept
preferred label: connect @en

interpréter
type: NamedIndividual
type: Concept
preferred label: construe @en
editorial note: Source de traduction : http://dictionnaire.reverso.net/anglais-francais/construe

inventer
type: NamedIndividual
type: Concept
preferred label: contrive @en

coordonner
type: NamedIndividual
type: Concept
preferred label: coordinate @en

correspondre
type: NamedIndividual
type: Concept
preferred label: correspond @en

compter
type: NamedIndividual
type: Concept
preferred label: count on @en
editorial note: source de traduciton : http://dictionnaire.reverso.net/anglais-francais/count

répliquer
type: NamedIndividual
type: Concept
preferred label: counterpoint @en
comment: source de traduction: http://dictionnaire.reverso.net/anglais-francais/counterpoint

déduire
type: NamedIndividual
type: Concept
preferred label: deduce @en

déduire
type: NamedIndividual
type: Concept
preferred label: deduct @en

tirer
type: NamedIndividual
type: Concept
preferred label: derive @en

désigner
type: NamedIndividual
type: Concept
preferred label: designate @en

discerner
type: NamedIndividual
type: Concept
preferred label: discern @en
editorial note: Source de traduciton : http://www.larousse.fr/dictionnaires/anglais-francais/discern/575813

discourir
type: NamedIndividual
type: Concept
preferred label: discourse @en
editorial note: Source de traduciton : http://dictionnaire.reverso.net/anglais-francais/discourse

découvrir
type: NamedIndividual
type: Concept
preferred label: discover @en

ébaucher
type: NamedIndividual
type: Concept
preferred label: draft @en

élucider
type: NamedIndividual
type: Concept
preferred label: elucidate @en

employer
type: NamedIndividual
type: Concept
preferred label: employ @en

assimiler
type: NamedIndividual
type: Concept
preferred label: equate @en
editorial note: Source de traduction : http://dictionnaire.reverso.net/anglais-francais/equate

essayer
type: NamedIndividual
type: Concept
preferred label: essay @en
editorial note: Source de traduction : http://bit.ly/14Hkd0P

estimer
type: NamedIndividual
type: Concept
preferred label: estimate @en

examiner
type: NamedIndividual
type: Concept
preferred label: examine @en
editorial note: Source traduction : http://dictionnaire.reverso.net/francais-anglais/examine

expliquer
type: NamedIndividual
type: Concept
preferred label: explicate @en

calculer
type: NamedIndividual
type: Concept
preferred label: figure
editorial note: source de traduction : http://dictionnaire.reverso.net/anglais-francais/figure

résoudre
type: NamedIndividual
type: Concept
preferred label: figure out @en

trouver
type: NamedIndividual
type: Concept
preferred label: find @en

ajuster
type: NamedIndividual
type: Concept
preferred label: fit @en
editorial note: Source de traduction : http://dictionnaire.reverso.net/anglais-francais/fit

fluxer
type: NamedIndividual
type: Concept
preferred label: flux @en
editorial note: Source de traduction : http://dictionnaire.reverso.net/anglais-francais/flux

focaliser
type: NamedIndividual
type: Concept
preferred label: focalise @en

focaliser
type: NamedIndividual
type: Concept
preferred label: focalize @en

prévoir
type: NamedIndividual
type: Concept
preferred label: forecast @en

présager
type: NamedIndividual
type: Concept
preferred label: forebode @en
editorial note: Source de traduction : http://dictionnaire.reverso.net/anglais-francais/forebode

prédire
type: NamedIndividual
type: Concept
preferred label: foretell @en

accomplir
type: NamedIndividual
type: Concept
preferred label: fulfil @en

accomplir
type: NamedIndividual
type: Concept
preferred label: fullfill @en
editorial note: Source de traduciton : http://fr.glosbe.com/en/fr/fulfill

fusionner
type: NamedIndividual
type: Concept
preferred label: fuse @en
editorial note: Source de traduciton: http://dictionnaire.reverso.net/anglais-francais/fuse

jauger
type: NamedIndividual
type: Concept
preferred label: gauge @en
editorial note: Source de traduction : http://dictionnaire.reverso.net/francais-anglais/jauger

généraliser
type: NamedIndividual
type: Concept
preferred label: generalize @en

donner
type: NamedIndividual
type: Concept
preferred label: give @en
editorial note: source de traduciton : http://dictionnaire.reverso.net/anglais-francais/give e.g. donner le résultat

revoir
type: NamedIndividual
type: Concept
preferred label: go over @en
editorial note: Source de traduction : http://dictionnaire.reverso.net/anglais-francais/go%20over

deviner
type: NamedIndividual
type: Concept
preferred label: guess @en
editorial note: Source de traduction : http://dictionnaire.reverso.net/anglais-francais/guess

hypothéquer
type: NamedIndividual
type: Concept
preferred label: hypothecate @en

supposer
type: NamedIndividual
type: Concept
preferred label: hypothesize @en

interférer
type: NamedIndividual
type: Concept
preferred label: immix @en
editorial note: Source de traduction : http://dictionnaire.reverso.net/francais-anglais/immix

incorporer
type: NamedIndividual
type: Concept
preferred label: incorporate @de
definition: make into a whole or make part of a whole @en

indiquer
type: NamedIndividual
type: Concept
preferred label: indicate @en
editorial note: Source de traduciton : http://dictionnaire.reverso.net/anglais-francais/indicate

instancer
type: NamedIndividual
type: Concept
preferred label: instance @en

s'accorder
type: NamedIndividual
type: Concept
preferred label: jibe @en
comment: Source de traduction : http://www.larousse.fr/dictionnaires/anglais-francais/jibe/590140?q=+jibe

indexer
type: NamedIndividual
type: Concept
preferred label: key @en
editorial note: Source de traduction : http://dictionnaire.reverso.net/anglais-francais/key

faire la différence
type: NamedIndividual
type: Concept
preferred label: know apart @en
editorial note: source de traduction : http://www.wordreference.com/enfr/know%20apart

relier
type: NamedIndividual
type: Concept
preferred label: link @en

relier
type: NamedIndividual
type: Concept
scope note: http://dictionnaire.reverso.net/anglais-francais/link%20up
preferred label: link up @en

comparer
type: NamedIndividual
type: Concept
scope note: http://www.larousse.fr/dictionnaires/anglais-francais/liken/592312
preferred label: linken @en

examiner
type: NamedIndividual
type: Concept
preferred label: look into @en
editorial note: Source de traduction : http://dictionnaire.reverso.net/anglais-francais/look%20into

faire
type: NamedIndividual
type: Concept
preferred label: make @en

distinguer
type: NamedIndividual
type: Concept
preferred label: make out @en

marquer
type: NamedIndividual
type: Concept
preferred label: mark @en

mesurer
type: NamedIndividual
type: Concept
preferred label: measure @en

mêler
type: NamedIndividual
type: Concept
preferred label: meld @en

fusionner
type: NamedIndividual
type: Concept
preferred label: merge @en

mixer
type: NamedIndividual
type: Concept
preferred label: mix @en

narrer
type: NamedIndividual
type: Concept
preferred label: narrate @en

remarquer
type: NamedIndividual
type: Concept
preferred label: notice @en

observer
type: NamedIndividual
type: Concept
preferred label: observe @en

ordonner
type: NamedIndividual
type: Concept
preferred label: order @en

organiser
type: NamedIndividual
type: Concept
preferred label: organize @en

opter
type: NamedIndividual
type: Concept
preferred label: pick out @en
editorial note: Source de traduction : http://fr.glosbe.com/en/fr/pick%20out

placer
type: NamedIndividual
type: Concept
preferred label: place @en
editorial note: Source de traduction : http://www.larousse.fr/dictionnaires/anglais-francais/place/602349

indiquer
type: NamedIndividual
type: Concept
preferred label: point @en

pronostiquer
type: NamedIndividual
type: Concept
preferred label: prognosticate @en

projeter
type: NamedIndividual
type: Concept
preferred label: project @en

promettre
type: NamedIndividual
type: Concept
preferred label: promise @en

prover
type: NamedIndividual
type: Concept
preferred label: prove @en

placer
type: NamedIndividual
type: Concept
preferred label: put @en

résoudre
type: NamedIndividual
type: Concept
preferred label: puzzle out @en
editorial note: source de traduction : http://www.wordreference.com/enfr/puzzle%20out%20

Re-expliquer
type: NamedIndividual
type: Concept
preferred label: Re-explain @en
definition: interpret from a different viewpoint @en

lire
type: NamedIndividual
type: Concept
preferred label: read @en

se rendre compte de
type: NamedIndividual
type: Concept
preferred label: realize @en

raisonner
type: NamedIndividual
type: Concept
preferred label: reason @en

trouver une solution
type: NamedIndividual
type: Concept
preferred label: reason out @en
editorial note: Source de traduction : http://dictionnaire.reverso.net/anglais-francais/reason

compter
type: NamedIndividual
type: Concept
preferred label: reckon @en

se rappeler
type: NamedIndividual
type: Concept
preferred label: recollect @en
editorial note: Source de traduction : http://dictionnaire.reverso.net/anglais-francais/%20recollect

raconter
type: NamedIndividual
type: Concept
preferred label: recount @en
editorial note: Source de traduction : http://dictionnaire.reverso.net/anglais-francais/recount

Réinterpréter
type: NamedIndividual
type: Concept
definition: Interpret from a different viewpoint @en
preferred label: Reinterpret @en

associer
type: NamedIndividual
type: Concept
preferred label: relate @en

restituer
type: NamedIndividual
type: Concept
preferred label: render @en
definition: source de traduction : http://dictionnaire.reverso.net/anglais-francais/render

reformuler
type: NamedIndividual
type: Concept
preferred label: rephrase @en

raconter à nouveau
type: NamedIndividual
type: Concept
preferred label: retell @en
editorial note: Source de traduction : http://dictionnaire.reverso.net/anglais-francais/retell

rendre
type: NamedIndividual
type: Concept
editorial note: Source de traduciton : http://dictionnaire.reverso.net/anglais-francais/return
preferred label: return

réviser
type: NamedIndividual
type: Concept
preferred label: review @en

reformuler
type: NamedIndividual
type: Concept
preferred label: reword @en
editorial note: Source de traduction : http://dictionnaire.reverso.net/anglais-francais/reword

discerner
type: NamedIndividual
type: Concept
preferred label: secern @en
editorial note: Source de traduction : http://fr.glosbe.com/en/fr/secern

discerner
type: NamedIndividual
type: Concept
preferred label: secernate @en

voir
type: NamedIndividual
type: Concept
preferred label: see @en
editorial note: Source de traduction : http://dictionnaire.reverso.net/anglais-francais/see

séparer
type: NamedIndividual
type: Concept
preferred label: separate @en

mettre en place
type: NamedIndividual
type: Concept
preferred label: set up @en
editorial note: source de traduction : http://fr.glosbe.com/en/fr/set%20up

discerner
type: NamedIndividual
type: Concept
preferred label: severalise @en

discerner
type: NamedIndividual
type: Concept
preferred label: severalize @en

esquisser
type: NamedIndividual
type: Concept
preferred label: sketch @en

trier
type: NamedIndividual
type: Concept
preferred label: sort @en
comment: Source de traduction : http://dictionnaire.reverso.net/anglais-francais/sort

mettre en ordre
type: NamedIndividual
type: Concept
scope note: http://www.larousse.fr/dictionnaires/anglais-francais/sort_out/613415#613418
preferred label: sort out @en

spéculer
type: NamedIndividual
type: Concept
preferred label: speculate @en

repérer
type: NamedIndividual
type: Concept
preferred label: spot @en
editorial note: Source de traduciton : http://www.larousse.fr/dictionnaires/anglais-francais/spot/614143

signifier
type: NamedIndividual
type: Concept
preferred label: stand for @en
editorial note: Source de taduction : http://dictionnaire.reverso.net/anglais-francais/stand%20for

étudier
type: NamedIndividual
type: Concept
scope note: http://wordnetweb.princeton.edu/perl/webwn
definition: consider in detail and subject to an analysis in order to discover essential features or meaning @en
preferred label: study @en

résumer
type: NamedIndividual
type: Concept
preferred label: sum @en

résumer
type: NamedIndividual
type: Concept
preferred label: sum up @en

récapituler
type: NamedIndividual
type: Concept
preferred label: summarise @en
editorial note: Source de traduction : http://dictionnaire.reverso.net/anglais-francais/summarise

superviser
type: NamedIndividual
type: Concept
preferred label: supervise @en

supposer
type: NamedIndividual
type: Concept
preferred label: suppose @en

repérer
type: NamedIndividual
type: Concept
preferred label: suss out @en
editorial note: Source de traduction : http://dictionnaire.reverso.net/anglais-francais/suss%20out

symboliser
type: NamedIndividual
type: Concept
preferred label: symbolise @en

symboliser
type: NamedIndividual
type: Concept
preferred label: symbolize @en

étiqueter
type: NamedIndividual
type: Concept
preferred label: tag @en

prendre
type: NamedIndividual
type: Concept
preferred label: take @en

parler
type: NamedIndividual
type: Concept
preferred label: talk about @en

correspondre
type: NamedIndividual
type: Concept
preferred label: tally @en
editorial note: Source de traduciton : http://dictionnaire.reverso.net/anglais-francais/tally

dire
type: NamedIndividual
type: Concept
preferred label: tell @en
comment: Source de traduction : http://dictionnaire.reverso.net/anglais-francais/tell

discerner
type: NamedIndividual
type: Concept
definition: mark as different @en
preferred label: tell apart @en
comment: Source de traduction : http://fr.glosbe.com/en/fr/tell%20apart

théoriser
type: NamedIndividual
type: Concept
preferred label: theorise @en

théoriser
type: NamedIndividual
type: Concept
preferred label: theorize @en

se rappeler de
type: NamedIndividual
type: Concept
preferred label: think @en
editorial note: Source de traduction : http://dictionnaire.reverso.net/anglais-francais/think

lier
type: NamedIndividual
type: Concept
preferred label: tie in @en

essayer
type: NamedIndividual
type: Concept
preferred label: try @en

essayer
type: NamedIndividual
type: Concept
preferred label: try out @en

caractériser
type: NamedIndividual
type: Concept
preferred label: typify @en

recommander
type: NamedIndividual
type: Concept
preferred label: urge @en
editorial note: Source de traduction : http://dictionnaire.reverso.net/anglais-francais/urge

employer
type: NamedIndividual
type: Concept
preferred label: utilise @en

employer
type: NamedIndividual
type: Concept
preferred label: utilize @en

estimer
type: NamedIndividual
type: Concept
preferred label: valuate @en

estimer
type: NamedIndividual
type: Concept
preferred label: value @en
editorial note: Source de traduction : http://dictionnaire.reverso.net/anglais-francais/value

résoudre
type: NamedIndividual
type: Concept
preferred label: work out @en
editorial note: source de traduction : http://www.wordreference.com/enfr/workout

donner
type: NamedIndividual
type: Concept
preferred label: yield @en
comment: Source de traduction : http://dictionnaire.reverso.net/anglais-francais/yield Yield = donner le résultat

Jean-Claude Moissinac
type: NamedIndividual

Jirasri Deslis
type: NamedIndividual
type: Jean-Claude Moissinac