programme histoire des arts tbox
type: Ontology
comment: L'ontologie de l'enseignement de l'Histoire des Arts est conçue dans le cadre du projet ILOT (http://shadok.enst.fr/ilot/). La conception de cette ontologie est faite selon Arrêté du 11-7-2008 avec ses 4 articles dans l’Encart du Bulletin officiel n° 32 du 28 août 2008 : « Organisation de l’enseignement de l’histoire des arts à l’école primaire, au collège et au lycée », [En ligne : http://www.education.gouv.fr/cid22078/mene0817383a.html]. Défintition: L’enseignement de l’histoire des arts est obligatoire pour tous les élèves de l’Ecole primaire, du Collège et du Lycée (voies générale, technologique et professionnelle). C’est un enseignement fondé sur une approche pluridisciplinaire et transversale des œuvres d’art. L’enseignement de l’histoire des arts implique la conjonction de plusieurs champs de connaissances. Il s’appuie sur trois piliers : les « périodes historiques », les six grands « domaines artistiques » et la « liste de référence » pour l’Ecole primaire ou les « listes de thématiques » pour le Collège et le Lycée. Voir également : http://cache.media.education.gouv.fr/file/32/09/0/encart_33090.pdf Auteurs: Jirasri Deslis et Jean-Claude Moissinac

Abbaye
type: Class
label: Abbey @en
subclass of: Une architecture religieuse
comment: Catégorie dans Wikipédia : http://fr.wikipedia.org/wiki/Cat%C3%A9gorie:Abbaye Catégorie dans DBpédia : http://fr.dbpedia.org/page/Cat%C3%A9gorie:Abbaye

Destinataire
type: Class
label: Addressee @en
subclass of: Usage
comment: Référenec de la traduction en anglais : http://dictionnaire.reverso.net/francais-anglais/destinataire

Champ esthétique
type: Class
label: Aesthetic field @en
subclass of: Liste des champs regroupant les thématiques au niveau de lycée

Une architecture antique
type: Class
label: An ancient architecture @en
subclass of: Liste de référence au niveau primaire
comment: Catégorie dans Wikipédia : http://fr.wikipedia.org/wiki/Cat%C3%A9gorie:Architecture_antique Catégorie dans DBpédia : http://fr.dbpedia.org/page/Cat%C3%A9gorie:Architecture_antique

Anthropological field
type: Class
label: Champ anthropologique
subclass of: Liste des champs regroupant les thématiques au niveau de lycée

Arts appliqués
type: Class
label: Applied arts @en
subclass of: Art of Everyday Life
comment: Référence de la traduction en anglais :http://en.wikipedia.org/wiki/Applied_art

Détournement
type: Class
label: Appropriation @en
subclass of: Usage
comment: Référence de la traduction en anglais : http://dictionnaire.reverso.net/francais-anglais/d%C3%A9tournement Voir "détournement (domaine de l'art)"

Architecture
type: Class
subclass of: Arts de l'espace
subclass of: Arts du visuel

Arts et économie
type: Class
label: Arts and economy @en
subclass of: Champ historique et social
subclass of: Liste des thémathiques au niveau de collège et de Lycée

Arts et idéologies
type: Class
label: Arts and ideologies @en
subclass of: Champ historique et social
subclass of: Liste des thémathiques au niveau de collège et de Lycée

Arts et sacré
type: Class
label: Arts and sacred @en
subclass of: Anthropological field
subclass of: Liste des thémathiques au niveau de collège et de Lycée

Arts, corps, expressions
type: Class
label: Art, bodies, expressions @en
subclass of: Anthropological field
subclass of: Liste des thémathiques au niveau de collège et de Lycée

Arts, créations, cultures
type: Class
label: Arts, creation, cultures @en
subclass of: Liste des thémathiques au niveau de collège et de Lycée
comment: Définition selon le programme : Cette thématique permet d’aborder les œuvres d’art à travers les cultures, les sociétés, les civilisations dont elles construisent l’identité et la diversité. (cf: http://cache.media.education.gouv.fr/file/32/09/0/encart_33090.pdf, p. 9)

Arts, informations, communications
type: Class
subclass of: Champ technique
subclass of: Liste des thémathiques au niveau de collège et de Lycée

Arts, mémoires, témoignages, engagements
type: Class
label: Arts, memories,testimonies, engagements @en
subclass of: Champ historique et social
subclass of: Liste des thémathiques au niveau de collège et de Lycée

Arts, mythes et religions
type: Class
label: Arts, myths and religions @en
subclass of: Liste des thémathiques au niveau de collège et de Lycée

Objets d'art
type: Class
label: Art objects @en
subclass of: Art of Everyday Life
comment: Référence de la traduction en anglais : http://en.wikipedia.org/wiki/Objet_d%27art

Art of Everyday Life
type: Class
label: Arts du quotidien @en
subclass of: Domaines artistiques
comment: Référence de la traduction en anglais: http://www.tate.org.uk/context-comment/video/constructivism-and-art-everyday-life-part-8

Arts de l'espace
type: Class
label: Art of space @en
subclass of: Domaines artistiques

Les arts de la table
type: Class
label: The arts of the table @en
subclass of: Liste de référence au niveau primaire

Arts, réalités, imaginaires
type: Class
label: Arts, realities, imaginaries @en
subclass of: Anthropological field
subclass of: Liste des thémathiques au niveau de collège et de Lycée

Arts, contraintes, réalisations
type: Class
label: Arts, restraints, realisations @en
subclass of: Champ technique
subclass of: Liste des thémathiques au niveau de collège et de Lycée

Arts, ruptures, continuités
type: Class
label: Arts, ruptures, continuities @en
subclass of: Liste des thémathiques au niveau de collège et de Lycée

Arts, sciences, techniques
type: Class
subclass of: Champ technique
subclass of: Liste des thémathiques au niveau de collège et de Lycée

Arts, sociétés, cultures
type: Class
label: Arts, societies, cultures @en
subclass of: Anthropological field
subclass of: Liste des thémathiques au niveau de collège et de Lycée

Arts, espace, temps
type: Class
label: Arts, space, time @en
subclass of: Liste des thémathiques au niveau de collège et de Lycée
comment: Défnition selon le programme: Cette thématique permet d’aborder les œuvres d’art à partir des relations qu’elles établissent, implicitement ou explicitement, avec les notions de temps et d’espace. (cf: http://cache.media.education.gouv.fr/file/32/09/0/encart_33090.pdf, p. 9)

Arts, Etats et pouvoir
type: Class
label: Arts, States and power @en
subclass of: Liste des thémathiques au niveau de collège et de Lycée

Arts, goût, esthétiques
type: Class
label: Arts, tastes, aesthetic @en
subclass of: Champ esthétique
subclass of: Liste des thémathiques au niveau de collège et de Lycée

Arts, techniques, expressions
type: Class
subclass of: Liste des thémathiques au niveau de collège et de Lycée

Arts, théories et pratiques
type: Class
label: Arts, theories and practices @en
subclass of: Champ esthétique
subclass of: Liste des thémathiques au niveau de collège et de Lycée

Domaines artistiques
type: Class
label: Artistic domains @en
comment: Cf:Organisation de l’enseignement de l’histoire des arts, p. 8 : (http://cache.media.education.gouv.fr/file/32/09/0/encart_33090.pdf )

Style artistique
type: Class
label: Artistic style @en
subclass of: Forme

Audiovisuel
type: Class
label: Audiovisual @en
subclass of: Arts du visuel
comment: Référene de la traduction en anglais : http://en.wikipedia.org/wiki/Audiovisual

Ballet
type: Class
subclass of: Liste de référence au niveau primaire
comment: Catégorie dans Wikipédia : http://fr.wikipedia.org/wiki/Cat%C3%A9gorie:Ballet Catégorie dans DBpédia : http://fr.dbpedia.org/page/Cat%C3%A9gorie:Ballet

Pont
type: Class
label: Bridge @en
subclass of: Ouvrages d'art
comment: Catégorie dans Wikipédia : http://fr.wikipedia.org/wiki/Cat%C3%A9gorie:Pont Catégorie dans DBpédia : http://fr.dbpedia.org/page/Cat%C3%A9gorie:Pont

Castel
type: Class
label: Château fort @en
subclass of: A civil building
subclass of: Un bâtiment militaire
comment: Catégorie dans Wikipédia : http://fr.wikipedia.org/wiki/Cat%C3%A9gorie:Ch%C3%A2teau_fort_par_pays Catégorie dans DBpédia : http://fr.dbpedia.org/page/Cat%C3%A9gorie:Ch%C3%A2teau_fort_par_pays

Catégorie
type: Class
label: Category @en
subclass of: Forme

Château de la Loire
type: Class
label: Châteaux of the Loire Valley
subclass of: Une architecture royale
comment: Source de la traduction en anglais : http://en.wikipedia.org/wiki/Ch%C3%A2teaux_of_the_Loire_Valley Catégorie dans Wikipédia : http://fr.wikipedia.org/wiki/Cat%C3%A9gorie:Ch%C3%A2teau_de_la_Loire Catégorie dans DBpédia : http://fr.dbpedia.org/page/Cat%C3%A9gorie:Ch%C3%A2teau_de_la_Loire

Oeuvre cinématographique
type: Class
label: Cinematographic work @en
subclass of: Liste de référence au niveau primaire
comment: Catégorie dans Wikipédia : http://fr.wikipedia.org/wiki/Cat%C3%A9gorie:Cin%C3%A9ma Catégorie dans DBpédia : http://fr.dbpedia.org/page/Cat%C3%A9gorie:Cin%C3%A9ma

Arts du cirque
type: Class
label: Art of circus @en
subclass of: Arts du spectacle vivant

Un plan de ville
type: Class
label: A city map @en
subclass of: Liste de référence au niveau primaire

A civil building
type: Class
label: Un bâtimnet civil
subclass of: Liste de référence au niveau primaire
comment: Catégorie dans Wikipédia : http://fr.wikipedia.org/wiki/Cat%C3%A9gorie:Architecture_civile_du_Moyen_%C3%82ge Catégorie dans DBpédia : http://fr.dbpedia.org/page/Cat%C3%A9gorie:Architecture_civile_du_Moyen_%C3%82ge

Code
type: Class
subclass of: Signification

Bande dessinée
type: Class
label: Comics @en
subclass of: Arts du visuel
comment: Référene de la traduction en anglais : http://en.wikipedia.org/wiki/Comics

Constituant
type: Class
label: Component @en
subclass of: Forme
comment: Exemple de l'usage du mot "Component" en anglais ( http://en.wikipedia.org/wiki/Paint ) @en

Composition
type: Class
subclass of: Forme

Ouvrages d'art
type: Class
label: Construction works @en
subclass of: Liste de référence au niveau primaire
comment: Source de traductin en anglais : http://www.larousse.fr/dictionnaires/francais-anglais/ouvrage/56646 Catégorie dans Wikipédia : http://fr.wikipedia.org/wiki/Cat%C3%A9gorie:Ouvrage_d%27art Catégorie dans DBpédia : http://fr.dbpedia.org/page/Cat%C3%A9gorie:Ouvrage_d%27art

Un costume
type: Class
label: A costume @en
subclass of: Liste de référence au niveau primaire
comment: Catégorie dans Wikipédia : http://fr.wikipedia.org/wiki/Cat%C3%A9gorie:Costume Catégorie dans DBpédia : http://fr.dbpedia.org/page/Cat%C3%A9gorie:Costume

Danse
type: Class
subclass of: Arts du spectacle vivant

Décodage
type: Class
label: Decoding @en
subclass of: Signification

Des éléments de décoration
type: Class
label: Decoration elements @en
subclass of: Liste de référence au niveau primaire

Décryptage
type: Class
label: Decryption @en
subclass of: Signification

Design
type: Class
subclass of: Art of Everyday Life

Dessin
type: Class
label: Drawing @en
subclass of: Arts du visuel

matériels
type: Class
label: euipement @en
subclass of: Technique
comment: Référence de la traduction en anglais : http://dictionnaire.reverso.net/francais-anglais/mat%C3%A9riel

Fable
type: Class
subclass of: Arts du language
comment: Référence de la traduction en anglais : http://translate.google.fr/#fr/en/fable

Une fable de l'époque classique
type: Class
label: A fable of the Classical period @en
subclass of: Liste de référence au niveau primaire

Conte
type: Class
label: Fairy tale @en
subclass of: Arts du language
comment: Référence de la traduction en anglais : http://en.wikipedia.org/wiki/Fairy_tale

Un conte de l'époque classique
type: Class
label: A fairy tale of the Classic period @en
subclass of: Liste de référence au niveau primaire

Une fête
type: Class
label: A festival @en
subclass of: Liste de référence au niveau primaire
comment: Catégorie dans Wikipédia : http://fr.wikipedia.org/wiki/Cat%C3%A9gorie:F%C3%AAte_m%C3%A9di%C3%A9vale Catégorie dans DBpédia : http://fr.dbpedia.org/page/Cat%C3%A9gorie:F%C3%AAte_m%C3%A9di%C3%A9vale

Liste des champs regroupant les thématiques au niveau de lycée
type: Class
label: List of fields grouping themes of the Lycée level @en
comment: Au niveau du Lycée, Les thématiques sont librement choisies par les professeurs dans la liste suivante, qu’ils peuvent éventuellement compléter. Cette liste est répartie en quatre champs : 1. Champ anthropologique : « Arts, réalités, imaginaires » ; « Arts et sacré » ; « Arts, sociétés, cultures » ; « Arts, corps, expressions » 2. Champ historique et social : « Arts et économie »; « Arts et idéologies»; « Arts, mémoires, témoignages, engagements ». 3. Champ technique : « Arts, contraintes, réalisations » ; « Arts, sciences et techniques » ; « Arts, informations, communications ». 4. Champ esthétique : « Arts, artistes, critiques, publics » ; « Arts, goût, esthétiques » ; « Arts, théories et pratiques ». (cf: http://media.education.gouv.fr/file/32/09/0/encart_33090.pdf , p. 13)

Cinéma
type: Class
label: Film @en
subclass of: Arts du visuel
comment: Référene de la traduction en anglais : http://en.wikipedia.org/wiki/Film

Forme
type: Class
label: Form @en
subclass of: Etude des œuvres

Fortification
type: Class
subclass of: Une architecture militaire
comment: Catégorie dans Wikipédia : http://fr.wikipedia.org/wiki/Cat%C3%A9gorie:Fort_en_France Catégorie dans DBpédia : http://fr.dbpedia.org/page/Cat%C3%A9gorie:Fort_en_France

Un cité fortifiée
type: Class
label: A fortified city @en
subclass of: A civil building
subclass of: Un bâtiment militaire

Un jardin à la française
type: Class
subclass of: Liste de référence au niveau primaire
see also: A French formal garden @en

Fonction
type: Class
label: Function
subclass of: Usage

Mobilier
type: Class
label: Furniture @en
subclass of: Liste de référence au niveau primaire

Arts des jardins
type: Class
label: Garden art @en
subclass of: Arts de l'espace

Example of Artistic genres on Wikipédia (http://en.wikipedia.org/wiki/Category:Art_genres)
type: Class
label: Genre
subclass of: Forme
comment: Cf. également Blog "Culture artistique et Histoire des Arts" http://cultureartistique-histoiredesarts.fr/les-genres-artistiques-classiques/

Une église gothique
type: Class
label: A gothic church @en
subclass of: Une architecture religieuse
comment: Catégorie dans Wikipédia : http://fr.wikipedia.org/wiki/Cat%C3%A9gorie:%C3%89glise_gothique Catégorie dans DBpédia : http://fr.dbpedia.org/page/Cat%C3%A9gorie:%C3%89glise_gothique

Monuments grecs
type: Class
label: Greek monuments @en
subclass of: Une architecture antique
comment: Catégorie dans Wikipédia : http://fr.wikipedia.org/wiki/Cat%C3%A9gorie:Architecture_de_la_Gr%C3%A8ce_antique Catégorie dans DBpédia : http://fr.dbpedia.org/page/Cat%C3%A9gorie:Architecture_de_la_Gr%C3%A8ce_antique

Habitat
type: Class
label: Habitation @en
subclass of: Liste de référence au niveau primaire

Champ historique et social
type: Class
label: Historical and social field @en
subclass of: Liste des champs regroupant les thématiques au niveau de lycée

Image
type: Class
subclass of: Arts du visuel

Une architecture industrielle
type: Class
label: An industrial architecture @en
subclass of: Liste de référence au niveau primaire
comment: Catégorie dans Wikipédia : http://fr.wikipedia.org/wiki/Cat%C3%A9gorie:Architecture_industrielle Catégorie dans DBpédia : http://fr.dbpedia.org/page/Cat%C3%A9gorie:Architecture_industrielle

Musique instrumentale
type: Class
label: Instrumental @en
subclass of: Arts du son
comment: Référence de la traduction en anglais : http://en.wikipedia.org/wiki/Instrumental

Interprétation
type: Class
label: Interpretation @en
subclass of: Signification

Un roman de chevalerie
type: Class
label: A knight novel @en
subclass of: Liste de référence au niveau primaire

Arts du language
type: Class
label: Language Arts @en
subclass of: Domaines artistiques
comment: Référence de la traduction en anglais : http://en.wikipedia.org/wiki/Language_arts @en

Légende
type: Class
label: Legend @en
label: Référence de la traduction en anglais : http://translate.google.fr/#fr/en/l%C3%A9gende
subclass of: Arts du language

Liste de référence au niveau primaire
type: Class
label: List of reference for primary level @en
comment: Cette liste pour l'école primaire tient compte de la périodisation historique et des différents domaines artistiques. Elle n’indique pas d’oeuvres précises. Sans être exclusive, elle estdestinée à aider les enseignants dans le choix des oeuvres qui seront étudiées en classe. (cf: http://media.education.gouv.fr/file/32/09/0/encart_33090.pdf, p. 6)

Matériaux
type: Class
label: Materials @en
subclass of: Technique
comment: Référence de la traduction en anglais : http://en.wikipedia.org/wiki/Material

Sens
type: Class
label: Meaning @en
subclass of: Signification

Sens général
type: Class
label: General Meaning @en
subclass of: Sens

Sens particulier
type: Class
label: Particular meaning @en
subclass of: Sens

Sens usuel
type: Class
label: Usual meaning @en
subclass of: Sens

Mégalithe
type: Class
label: Megalith @en
subclass of: Une architecture préhistorique
comment: Catégorie dans Wikipédia : http://fr.wikipedia.org/wiki/Cat%C3%A9gorie:Site_m%C3%A9galithique Catégorie dans DBpédia : http://fr.dbpedia.org/page/Cat%C3%A9gorie:Site_m%C3%A9galithique

Message
type: Class
subclass of: Signification

Message interprété
type: Class
label: Message interpreted @en
subclass of: Message

Message reçu
type: Class
label: Message received @en
subclass of: Message

Message sent
type: Class
label: Message émis @en
subclass of: Message

Méthode corporelle
type: Class
label: Bodily method @en
subclass of: Technique

Méthode gestuelle
type: Class
label: Gestural method @en
subclass of: Technique

Instrumental Method
type: Class
label: Méthode instrumentale @en
subclass of: Technique

Une architecture militaire
type: Class
label: A military architecture @en
subclass of: Liste de référence au niveau primaire
comment: Catégorie dans Wikipédia : http://fr.wikipedia.org/wiki/Cat%C3%A9gorie:Architecture_militaire Catégorie dans DBpédia : http://fr.dbpedia.org/page/Cat%C3%A9gorie:Architecture_militaire

Un bâtiment militaire
type: Class
label: A mlilitary building @en
subclass of: Liste de référence au niveau primaire
comment: Catégorie dans Wikipédia : http://fr.wikipedia.org/wiki/Cat%C3%A9gorie:B%C3%A2timent_militaire Catégorie dans DBpédia : http://fr.dbpedia.org/page/Cat%C3%A9gorie:B%C3%A2timent_militaire @en

Mime
type: Class
subclass of: Arts du spectacle vivant

Mosquée
type: Class
label: Mosque @en
subclass of: Une architecture religieuse
comment: Catégorie dans Wikipédia : http://fr.wikipedia.org/wiki/Cat%C3%A9gorie:Mosqu%C3%A9e Catégorie dans DBpédia : http://fr.dbpedia.org/page/Cat%C3%A9gorie:Mosqu%C3%A9e

Musique
type: Class
label: Music @en
subclass of: Arts du spectacle vivant

Mythe
type: Class
label: Myth @en
subclass of: Arts du language
comment: Référence de la traduction en anglais : http://translate.google.fr/#fr/en/mythe

Nouvelle
type: Class
label: Novella @en
subclass of: Arts du language
comment: Réference de la traduction en anglais : http://en.wikipedia.org/wiki/Novella

Peinture
type: Class
label: Painting @en
subclass of: Arts du visuel

Château de Versailles
type: Class
label: Palace of Versailles @en
subclass of: Une architecture royale
comment: Catégorie dans Wikipédia : http://fr.wikipedia.org/wiki/Cat%C3%A9gorie:Ch%C3%A2teau_de_Versailles Catégorie dans DBpédia : http://fr.dbpedia.org/page/Cat%C3%A9gorie:Ch%C3%A2teau_de_Versailles

Arts du spectacle vivant
type: Class
label: Performing arts @en
subclass of: Domaines artistiques
comment: Référence de tradcution en anglais : http://en.wikipedia.org/wiki/Performing_arts

Photographie
type: Class
label: Photography @en
subclass of: Arts du visuel

Arts plastiques
type: Class
label: Plastic arts @en
subclass of: Arts du visuel

Poésie
type: Class
label: Poetry @en
subclass of: Arts du language
comment: Référence de la traduction en anglais : http://en.wikipedia.org/wiki/Poetry

Arts populaires
type: Class
label: Popular art @en
subclass of: Art of Everyday Life
comment: Equivalent en français : https://fr.wikipedia.org/wiki/Culture_populaire (?) Equivalent en anglais : https://en.wikipedia.org/wiki/Popular_culture (?)

Une architecture préhistorique
type: Class
label: A prehistorical architecture @en
subclass of: Liste de référence au niveau primaire
comment: Catégorie dans Wikipédia : http://fr.wikipedia.org/wiki/Cat%C3%A9gorie:Site_pr%C3%A9historique Catégorie dans DBpédia : http://fr.dbpedia.org/page/Cat%C3%A9gorie:Site_pr%C3%A9historique

Gare
type: Class
label: Railway station
subclass of: Une architecture industrielle
comment: Catégorie dans Wikipédia : http://fr.wikipedia.org/wiki/Cat%C3%A9gorie:Gare Catégorie dans DBpédia : http://fr.dbpedia.org/page/Cat%C3%A9gorie:Gare

Réception
type: Class
label: Reception @en
subclass of: Signification

Rejection
type: Class
label: Rejet
subclass of: Usage

Une architecture religieuse
type: Class
label: A religious architecture @en
subclass of: Liste de référence au niveau primaire
comment: Catégorie dans Wikipédia : http://fr.wikipedia.org/wiki/Cat%C3%A9gorie:Architecture_religieuse Catégorie dans DBpédia : http://fr.dbpedia.org/page/Cat%C3%A9gorie:Architecture_religieuse

Monuments gallo-romains
type: Class
label: Roman Gaul monuments @en
subclass of: Une architecture antique
comment: Catégorie dans Wikipédia : http://fr.wikipedia.org/wiki/Cat%C3%A9gorie:Monument_romain_en_France Catégorie dans DBpédia : http://fr.dbpedia.org/page/Cat%C3%A9gorie:Monument_romain_en_France

Monuments romains
type: Class
label: Roman monuments @en
subclass of: Une architecture antique
comment: Catégorie dans Wikipédia : http://fr.wikipedia.org/wiki/Cat%C3%A9gorie:Architecture_romaine_antique Catégorie dans DBpédia : http://fr.dbpedia.org/page/Cat%C3%A9gorie:Architecture_romaine_antique

Un église romane
type: Class
label: A romanesque church @en
subclass of: Une architecture religieuse
comment: Catégorie dans Wikipédia : http://fr.wikipedia.org/wiki/Cat%C3%A9gorie:%C3%89glise_romane Catégorie dans DBpédia : http://fr.dbpedia.org/page/Cat%C3%A9gorie:%C3%89glise_romane

Une architecture royale
type: Class
label: A royal architecture @en
subclass of: Liste de référence au niveau primaire

Sculpture
type: Class
subclass of: Arts du visuel

Signe
type: Class
label: Sign @en
subclass of: Signification

Signification
type: Class
subclass of: Etude des œuvres

Signifié
type: Class
label: Signified @en
subclass of: Signe

Signifier
type: Class
label: signifiant @en
subclass of: Signe
comment: Référenec de traduction en anglais : http://en.wikipedia.org/wiki/Signifier

Gratte-ciel
type: Class
label: Skyscraper @en
subclass of: Habitat
comment: Catégorie dans Wikipédia : http://fr.wikipedia.org/wiki/Cat%C3%A9gorie:Gratte-ciel Catégorie dans DBpédia : http://fr.dbpedia.org/page/Cat%C3%A9gorie:Gratte-ciel

Arts du son
type: Class
label: Sound art @en
subclass of: Domaines artistiques
comment: Référence de traduction vers anglais : http://en.wikipedia.org/wiki/Sound_art

Arts de la rue
type: Class
label: Street arts @en
subclass of: Arts du spectacle vivant

Structure
type: Class
subclass of: Forme

Etude des œuvres
type: Class
label: Studies of Art Works @en
comment: Etude des œuvres L’enseignement de l’histoire des arts est fondé sur l’étude des œuvres. Cette étude peut être effectuée à partir d’une œuvre unique ou d’un ensemble d’œuvres défini par des critères communs (lieu, genre, auteur, mouvement…). Les œuvres sont analysées à partir de quatre critères au moins : formes, techniques, significations, usages. Ces critères peuvent être abordés selon plusieurs plans d’analyse notamment: - formes : catégories, types, genres, styles artistiques ; constituants, structure, composition, etc. - techniques : matériaux, matériels, outils, supports, instruments ; méthodes et techniques corporelles, gestuelles, instrumentales, etc. - significations : message (émis, reçu, interprété); sens (usuel, général, particulier ; variations dans le temps et l’espace) ; code, signe (signifiant/ signifié) ; réception, interprétation, décodage, décryptage, etc. - usages : fonction, emploi ; catégories de destinataires et d’utilisateurs ; destination, utilisation, transformation, rejets, détournements, etc. (Cf: http://cache.media.education.gouv.fr/file/32/09/0/encart_33090.pdf ), p. 4

Support
type: Class
subclass of: Technique

Synagogue
type: Class
subclass of: Une architecture religieuse
comment: Catégorie dans Wikipédia : http://fr.wikipedia.org/wiki/Cat%C3%A9gorie:Synagogue Catégorie dans DBpédia : http://fr.dbpedia.org/page/Cat%C3%A9gorie:Synagogue

Champ technique
type: Class
label: Technical field @en
subclass of: Liste des champs regroupant les thématiques au niveau de lycée

Technique
type: Class
subclass of: Etude des œuvres

Technique corporelle
type: Class
label: Bordily technique @en
subclass of: Technique

Technique gestuelle
type: Class
label: Gestural technique @en
subclass of: Technique

Technique instrumentale
type: Class
label: Instrumental technique @en
subclass of: Technique

Technologie de diffusion musicale
type: Class
label: Technology of musical broadcasting @en
subclass of: Arts du son

Technologies de création musicale
type: Class
label: Technology of musical creation @en
subclass of: Arts du son

Théâtre
type: Class
label: Theatre @en
subclass of: Arts du language
subclass of: Arts du spectacle vivant

Une pièce de théâtre
type: Class
label: A theatre play @en
subclass of: Liste de référence au niveau primaire

Liste des thémathiques au niveau de collège et de Lycée
type: Class
label: List of themes for Collège and Lycée levels @en
comment: Cf: http://media.education.gouv.fr/file/32/09/0/encart_33090.pdf , p. 8 et p.13

Une maison à colombage
type: Class
label: A timber framing house @en
subclass of: A civil building

Outil
type: Class
label: Tool @en
subclass of: Technique

Transformation
type: Class
subclass of: Usage

Type
type: Class
subclass of: Forme

Urbanisme
type: Class
label: Urbanism @en
subclass of: Arts de l'espace

Usage
type: Class
label: Use @en
subclass of: Etude des œuvres

Utilisateur
type: Class
label: User @en
subclass of: Usage

Emploi
type: Class
label: Utilisation
subclass of: Usage

Vidéo
type: Class
label: Video @en
subclass of: Arts du visuel
comment: Référene de la traduction en anglais : http://en.wikipedia.org/wiki/Video

Arts du visuel
type: Class
label: Visual arts @en
subclass of: Domaines artistiques
comment: Référence de la traduction en anglais : http://en.wikipedia.org/wiki/Visual_arts

Musique vocale
type: Class
label: Vocal music @en
subclass of: Arts du son
comment: Référence de la traduction en anglais : https://en.wikipedia.org/wiki/Vocal_music

Une église gothique
label: A gothic church @en