Ontologie du système scolaire français
type: Ontology
label: French School System Ontology @en
comment: French School System Ontology build for the ILOT project @en
comment: Ontologie du système scolaire français, construite dans le cadre du projet français ILOT, soutenu par l'Agence Nationale de la Recherche décrit les enchaînements des parcours pédagogiques et les grandes lignes de leurs contenus (essentiellement les matières abordées)
version IRI: http://givingsense.eu/frscol/FrSchoolSysteml#0.0.1

est une compétence a acquerir pendant
type: AnnotationProperty
comment: Permet de relier une compétence à une séquence éducative qui doit permettre de l'acquérir
domain: Competency
type: ObjectProperty
range: Parcours éducatif
inverse of: a pour objectif l'acquisition de la capacité de
sub property of: est une partie de l'objectif du parcours

est une connaissance à acquerir pendant
type: AnnotationProperty
comment: Permet de relier une connaissance à une séquence éducative qui doit permettre de l'acquérir
domain: Knowledge
type: ObjectProperty
range: Parcours éducatif
inverse of: a pour objectif l'acquisition de la connaissance de
sub property of: est une partie de l'objectif du parcours

a pour filière
type: ObjectProperty
label: hasBranch @en
comment: Cette propriété permet d'indiquer a quelle filière appartient une instance de classe ou parcours (EducationalLevel, niveau éducatif).
range: Filière
domain: Class
  union of: 3ème
  union of: 4ème
  union of: Période du lycée

a pour élément
type: ObjectProperty
type: TransitiveProperty
comment: Relie un parcours aux éléments qui le composent
domain: Parcours éducatif
range: Parcours éducatif
inverse of: fait partie du parcours scolaire
sub property of: hasPart

a pour élément direct
type: ObjectProperty
comment: Relie un parcours aux éléments qui le composent directement (pas les sous-éléments)
range: Parcours éducatif
domain: Parcours éducatif
sub property of: a pour élément
inverse of: appartenance à un parcours éducatif (enchainement de niveaux)

est directement suivi par
type: ObjectProperty
comment: Permet de spécifier l'enchainement des périodes scolaires en indiquant par quelle période une période est directement suivie. L'enchainement suit une forme implicite de hiérarchie. Par exemple, la classe de second suit directement la classe de troisième tandis que le lycée suit directement le collège.
range: Parcours éducatif
domain: Parcours éducatif
inverse of: est directement précédé par
sub property of: est suivi de

est directement précédé par
type: ObjectProperty
label: hasPreviousPeriod @en
comment: Permet de spécifier l'enchainement des périodes scolaires en indiquant par quelle période une période est directement précédée. L'enchainement suit une forme implicite de hiérarchie. Par exemple, la classe de second suit directement la classe de troisième tandis que le lycée suit directement le collège.
range: Parcours éducatif
domain: Parcours éducatif
sub property of: est précédé par

dure
type: ObjectProperty
comment: Permet d'indiquer un objet a une durée
range: Durée
domain: Thing
sub property of: topObjectProperty

a pour matière
type: ObjectProperty
label: has for subject @en
comment: Permet d'indiquer de quelle matière relève une partie d'un programme
domain: Parcours éducatif
range: Matière

est suivi de
type: ObjectProperty
type: TransitiveProperty
comment: Permet d'indiquer une relation d'ordre entre périodes scolaires. Dans un triplet utilisant ce prédicat, la période définie par le sujet est suivie par la période définie par l'objet.
domain: Parcours éducatif
range: Parcours éducatif

concerne la période
type: ObjectProperty
comment: Permet d'indiquer de quel parcours éducatif relève un élément de programme
domain: Parcours éducatif
range: Thing

est précédé par
type: ObjectProperty
type: TransitiveProperty
comment: Permet d'indiquer une relation d'ordre entre périodes scolaires. Dans un triplet utilisant ce prédicat, la période définie par le sujet est précédé par la période définie par l'objet.
range: Parcours éducatif
domain: Parcours éducatif
inverse of: est suivi de

a pour objectif
type: ObjectProperty
comment: Permet d'accocier un objectif à une portion d'un programme
sub property of: hasPart
range: Thing
domain: Thing

a pour objectif l'acquisition de la capacité de
type: ObjectProperty
comment: Propriété qui permet d'associer une compétence que doit permettre d'acquérir une section de programme scolaire. Une compétence sera souvent décrite par un verbe -par exemple pris dans le vocabulaire de Bloom- suivi d'un sujet (ex: décrire un monument d'Egypte).
range: Competency
domain: Parcours éducatif
sub property of: a pour objectif

a pour objectif l'acquisition de la connaissance de
type: ObjectProperty
comment: Relie une séquence pédagogique à une connaissance qu'elle doit permettre d'acquérir
range: Knowledge
domain: Parcours éducatif
sub property of: a pour objectif

est une filière de
type: ObjectProperty
comment: Indique que cette filière trouve son application dans un parcours
domain: Filière
inverse of: a pour filière
range: Class
  union of: 3ème
  union of: 4ème
  union of: Période du lycée

est de la durée de
type: ObjectProperty
comment: Relie une durée à un élément dont c'est la durée
domain: Durée
inverse of: dure
range: Thing

est abordé pendant
type: ObjectProperty
comment: Relie une matière à une séuqnece éducative (parcours) pendant laquelle cette matière est abordée
range: Parcours éducatif
domain: Matière
inverse of: a pour matière

appartenance à un parcours éducatif (enchainement de niveaux)
type: ObjectProperty
label: belongs to an educational pathway @en
comment: Permet d'indiquer qu'un parcours pédagogique est une des parties d'un parcours pédagogique plus large. Indique de plus que cette inclusion est directe (ex: la sixième est une partie directe du collège; le collège est une partie du secondaire, mais la sixième n'est pas directement une partie du secondaire). Cela permet d'avoir une forme de hiérarchie dans les parcours scolaires.
domain: Parcours éducatif
range: Parcours éducatif
sub property of: fait partie du parcours scolaire

fait partie du parcours scolaire
type: ObjectProperty
type: TransitiveProperty
label: inPathway @en
comment: Permet d'indiquer qu'un parcours pédagogique est une des parties d'un parcours pédagogique plus large (ex: la sixième est une partie du collège; le collège est une partie du secondaire)
domain: Parcours éducatif
range: Parcours éducatif
sub property of: isPartOf

est un niveau éducatif pour le parcours
type: ObjectProperty
comment: Indique un parcours dans lequel s'inscrit la niveau scolaire concerné.
range: Parcours éducatif
inverse of: concerne la période
domain: Thing
sub property of: topObjectProperty

est une partie de l'objectif du parcours
type: ObjectProperty
comment: Propriété qui permet d'indiquer dans quel partie d'un programme s'inscrit un objectif (connaissance, compétence...). Domain et Range ne sont volontairement pas précisés pour permettre de nombreuses associations.
inverse of: a pour objectif
sub property of: isPartOf
range: Thing
domain: Thing

Filière
type: Class
label: Branch @en
comment: Le système scolaire français spécialise certaines niveaux scolaires par profils de programme. Ainsi, pour un même niveau plusieurs programmes différents peuvent coexister, chacun décrivant le programme d'une filière.

Durée
type: Class
comment: Exprime la durée d'une chose

Niveau
type: Class
label: Educational Level @en
subclass of: Parcours éducatif
comment: Classe destinée à recevoir les descriptions des parcours pédagogiques correspondant à une année scolaire (un 'niveau'). Même concept que EducationalLevel dans GeoSkills mais GeoSkills n'a pas les niveaux français remarque issue de GeoSkills "TODO: Implement the whole list of school types (Eurydice document) as individuals here" (string)

Parcours éducatif
type: Class
label: Educational Pathway @en
subclass of: Restriction
  on property: dure
  some values from: Durée
subclass of: Restriction
  on property: est directement précédé par
  some values from: Parcours éducatif
subclass of: Restriction
  on property: est directement suivi par
  some values from: Parcours éducatif
subclass of: Restriction
  on property: a pour matière
  some values from: Matière
comment: Un parcours peut-être composé d'individus de la classe EducationalPathway et d'individus de la calsse EducationalLevel. La définition est récursive -un parcours pouvant contenir d'autres parcours.
version info: est claqué sur la classe de GeoSkills, pour faciliter le mapping

Matière
type: Class
label: Educational subject @en
comment: Matière abordée pendant le programme scolaire

Système scolaire français
type: Class
label: French School System @en
subclass of: Parcours éducatif
comment: Classe destinée à définir les instances du système scolaire français. N'aura probablement qu'un individu associé.

Première
type: Class
subclass of: Niveau
subclass of: Restriction
  on property: a pour filière
  some values from: Filière
subclass of: Restriction
  on property: est directement suivi par
  some values from: Terminale
subclass of: Restriction
  on property: isPartOf
  on class: Période du lycée
  min qualified cardinality: 1
subclass of: Restriction
  on property: appartenance à un parcours éducatif (enchainement de niveaux)
  on class: Période du lycée
  qualified cardinality: 1
disjoint with: Seconde
disjoint with: Terminale
comment: Classe générale pour les instances de la classe de première

Seconde
type: Class
subclass of: Niveau
subclass of: Restriction
  on property: appartenance à un parcours éducatif (enchainement de niveaux)
  on class: Période du lycée
  qualified cardinality: 1
subclass of: Restriction
  on property: est directement suivi par
  on class: Première
  qualified cardinality: 1
subclass of: Restriction
  on property: isPartOf
  on class: Période du lycée
  min qualified cardinality: 1
disjoint with: Terminale
comment: Classe générale pour les instances de la classe de seconde

3ème
type: Class
subclass of: Niveau
subclass of: Restriction
  on property: appartenance à un parcours éducatif (enchainement de niveaux)
  on class: Période du collège
  qualified cardinality: 1
subclass of: Restriction
  on property: isPartOf
  on class: Période du collège
  min qualified cardinality: 1
subclass of: Restriction
  on property: est directement suivi par
  on class: Seconde
  qualified cardinality: 1
subclass of: Restriction
  on property: a pour filière
  on class: Filière
  min qualified cardinality: 1
comment: Classe générale pour les instances de la classe de troisième

4ème
type: Class
subclass of: Niveau
subclass of: Restriction
  on property: est directement suivi par
  on class: 3ème
  qualified cardinality: 1
subclass of: Restriction
  on property: appartenance à un parcours éducatif (enchainement de niveaux)
  on class: Période du collège
  qualified cardinality: 1
subclass of: Restriction
  on property: isPartOf
  on class: Période du collège
  min qualified cardinality: 1
subclass of: Restriction
  on property: a pour filière
  on class: Filière
  min qualified cardinality: 1
comment: Classe générale pour les instances de la classe de quatrième

5ème
type: Class
subclass of: Niveau
subclass of: Restriction
  on property: isPartOf
  on class: Période du collège
  min qualified cardinality: 1
subclass of: Restriction
  on property: est directement suivi par
  on class: 4ème
  qualified cardinality: 1
subclass of: Restriction
  on property: appartenance à un parcours éducatif (enchainement de niveaux)
  on class: Période du collège
  qualified cardinality: 1
comment: Classe générale pour les instances de la classe de cinquième

6ème
type: Class
subclass of: Niveau
subclass of: Restriction
  on property: isPartOf
  on class: Période du collège
  min qualified cardinality: 1
subclass of: Restriction
  on property: appartenance à un parcours éducatif (enchainement de niveaux)
  on class: Période du collège
  qualified cardinality: 1
subclass of: Restriction
  on property: est directement suivi par
  on class: 5ème
  qualified cardinality: 1
comment: Classe générale pour les instances de la classe de sixième

CE1
type: Class
subclass of: Niveau
subclass of: Restriction
  on property: appartenance à un parcours éducatif (enchainement de niveaux)
  some values from: Cycle 2 ou cycle des apprentissages fondamentaux
subclass of: Restriction
  on property: isPartOf
  on class: Cycle 2 ou cycle des apprentissages fondamentaux
  min qualified cardinality: 1
subclass of: Restriction
  on property: est directement suivi par
  some values from: CE2
comment: Classe générale pour les instances de la classe de CE1

CE2
type: Class
subclass of: Niveau
subclass of: Restriction
  on property: est directement suivi par
  some values from: CM1
subclass of: Restriction
  on property: isPartOf
  on class: Cycle 3
  min qualified cardinality: 1
subclass of: Restriction
  on property: appartenance à un parcours éducatif (enchainement de niveaux)
  some values from: Cycle 3
comment: Classe générale pour les instances de la classe de CE2

CM1
type: Class
subclass of: Niveau
subclass of: Restriction
  on property: est directement suivi par
  some values from: CM2
subclass of: Restriction
  on property: isPartOf
  on class: Cycle 3
  min qualified cardinality: 1
subclass of: Restriction
  on property: appartenance à un parcours éducatif (enchainement de niveaux)
  on class: Cycle 3
  qualified cardinality: 1
comment: Classe générale pour les instances de la classe de CM1

CM2
type: Class
subclass of: Niveau
subclass of: Restriction
  on property: isPartOf
  on class: Cycle 3
  min qualified cardinality: 1
subclass of: Restriction
  on property: appartenance à un parcours éducatif (enchainement de niveaux)
  on class: Cycle 3
  qualified cardinality: 1
comment: Classe générale pour les instances de la classe de CM2

CP
type: Class
subclass of: Niveau
subclass of: Restriction
  on property: est directement suivi par
  some values from: CE1
subclass of: Restriction
  on property: appartenance à un parcours éducatif (enchainement de niveaux)
  on class: Cycle 2 ou cycle des apprentissages fondamentaux
  qualified cardinality: 1
comment: Classe générale pour les instances de la classe de CP

Période du collège
type: Class
subclass of: Parcours éducatif
subclass of: Restriction
  on property: isPartOf
  on class: Période du secondaire
  min qualified cardinality: 1
subclass of: Restriction
  on property: est directement suivi par
  some values from: Période du lycée
subclass of: Restriction
  on property: appartenance à un parcours éducatif (enchainement de niveaux)
  on class: Période du secondaire
  qualified cardinality: 1
subclass of: Restriction
  on property: est directement précédé par
  some values from: Période du primaire
disjoint with: Période du lycée
comment: Classe destinée à décrire les parcours pédagogiques correspondants à la dénimination 'collège'. N'aura probablement qu'un seul individu associé.

Cycle 2 ou cycle des apprentissages fondamentaux
type: Class
subclass of: Parcours éducatif
subclass of: Restriction
  on property: appartenance à un parcours éducatif (enchainement de niveaux)
  on class: Période du primaire
  qualified cardinality: 1
subclass of: Restriction
  on property: isPartOf
  on class: Période du primaire
  min qualified cardinality: 1
comment: Classe destinée à décrire les parcours pédagogiques correspondants au cycle 2 du parcours 'primaire'. N'aura probablement qu'un seul individu associé.

Cycle 3
type: Class
subclass of: Parcours éducatif
subclass of: Restriction
  on property: isPartOf
  on class: Période du primaire
  min qualified cardinality: 1
subclass of: Restriction
  on property: appartenance à un parcours éducatif (enchainement de niveaux)
  on class: Période du primaire
  qualified cardinality: 1
comment: Classe destinée à décrire les parcours pédagogiques correspondants au cycle 3 du parcours 'primaire'. N'aura probablement qu'un seul individu associé.

Grande section de maternelle (GS)
type: Class
label: PeriodGS @en
subclass of: Niveau
subclass of: Restriction
  on property: est directement suivi par
  some values from: CP
subclass of: Restriction
  on property: appartenance à un parcours éducatif (enchainement de niveaux)
  some values from: Cycle 2 ou cycle des apprentissages fondamentaux
subclass of: Restriction
  on property: isPartOf
  on class: Cycle 2 ou cycle des apprentissages fondamentaux
  min qualified cardinality: 1
comment: Classe destinée à décrire les parcours pédagogiques correspondants à la grande section de maternelle. N'aura probablement qu'un seul individu associé.

Période du lycée
type: Class
subclass of: Parcours éducatif
subclass of: Restriction
  on property: isPartOf
  on class: Période du secondaire
  min qualified cardinality: 1
subclass of: Restriction
  on property: appartenance à un parcours éducatif (enchainement de niveaux)
  on class: Période du secondaire
  qualified cardinality: 1
subclass of: Restriction
  on property: est directement précédé par
  some values from: Période du collège
comment: Classe destinée à décrire les parcours pédagogiques correspondants à la dénimination 'lycée'. N'aura probablement qu'un seul individu associé.

Période du primaire
type: Class
subclass of: Parcours éducatif
subclass of: Restriction
  on property: est directement suivi par
  some values from: Période du secondaire
subclass of: Restriction
  on property: appartenance à un parcours éducatif (enchainement de niveaux)
  on class: Système scolaire français
  qualified cardinality: 1
disjoint with: Période du secondaire
comment: Classe destinée à décrire les parcours pédagogiques correspondants à la dénimination 'primaire'. N'aura probablement qu'un seul individu associé.

Période du secondaire
type: Class
subclass of: Parcours éducatif
subclass of: Restriction
  on property: appartenance à un parcours éducatif (enchainement de niveaux)
  on class: Système scolaire français
  qualified cardinality: 1
subclass of: Restriction
  on property: est directement précédé par
  some values from: Période du primaire
comment: Classe destinée à décrire les parcours pédagogiques correspondants à la dénimination 'secondaire'. N'aura probablement qu'un seul individu associé.

Terminale
type: Class
subclass of: Niveau
subclass of: Restriction
  on property: isPartOf
  on class: Période du lycée
  min qualified cardinality: 1
subclass of: Restriction
  on property: appartenance à un parcours éducatif (enchainement de niveaux)
  on class: Période du lycée
  qualified cardinality: 1
subclass of: Restriction
  on property: a pour filière
  on class: Filière
  qualified cardinality: 1
comment: Classe générale pour les instances de la classe de terminale

Première générale
type: NamedIndividual
type: Première
description: Instance de la classe Period5 destinée à représenter les connaissances sur la classe de 5e commune.
est directement précédé par: Classe de seconde générale
a pour filière: Flilière générale
dure: 1 an
a pour matière: Français
a pour matière: Géographie
a pour matière: Histoire
a pour matière: Histoire de l'Art
a pour matière: Sciences de la Vie
a pour matière: Mathématiques
a pour matière: Education musicale
a pour matière: Education physique
a pour matière: Physique
est directement suivi par: Terminale générale

Première professionnelle
type: NamedIndividual
type: Première
description: Instance de la classe Period5 destinée à représenter les connaissances sur la classe de 5e commune.
est directement précédé par: 2eme Professionnelle
a pour filière: Filière professionnelle
dure: 1 an
a pour matière: Français
a pour matière: Géographie
a pour matière: Histoire
a pour matière: Histoire de l'Art
a pour matière: Sciences de la Vie
a pour matière: Mathématiques
a pour matière: Education musicale
a pour matière: Education physique
a pour matière: Physique
est directement suivi par: terminaleProfessionelle

Première technologique
type: NamedIndividual
type: Première
description: Instance de la classe Period5 destinée à représenter les connaissances sur la classe de 5e commune.
est directement précédé par: 2eme Technologique
a pour filière: Filière technologique
dure: 1 an
a pour matière: Français
a pour matière: Géographie
a pour matière: Histoire
a pour matière: Histoire de l'Art
a pour matière: Sciences de la Vie
a pour matière: Mathématiques
a pour matière: Education musicale
a pour matière: Education physique
a pour matière: Physique

Classe de seconde générale
type: NamedIndividual
type: Seconde
label: 2emeGenerale @en
description: Instance de la classe Period5 destinée à représenter les connaissances sur la classe de 5e commune.
est directement suivi par: Première générale
est directement précédé par: Classe de 3ème
a pour filière: Flilière générale
dure: 1 an
a pour matière: Français
a pour matière: Géographie
a pour matière: Histoire
a pour matière: Histoire de l'Art
a pour matière: Sciences de la Vie
a pour matière: Mathématiques
a pour matière: Education musicale
a pour matière: Education physique
a pour matière: Physique

2eme Professionnelle
type: NamedIndividual
type: Seconde
label: 2emeProfessionnelle @en
description: Instance de la classe Period5 destinée à représenter les connaissances sur la classe de 5e commune.
est directement précédé par: Classe de 3ème
dure: 1 an
a pour matière: Français
a pour matière: Géographie
a pour matière: Histoire
a pour matière: Histoire de l'Art
a pour matière: Sciences de la Vie
a pour matière: Mathématiques
a pour matière: Education musicale
a pour matière: Education physique
a pour matière: Physique

2eme Technologique
type: NamedIndividual
type: Seconde
label: 2emeTechnologique @en
description: Instance de la classe Period5 destinée à représenter les connaissances sur la classe de 5e commune.
est directement précédé par: Classe de 3ème
a pour filière: Filière technologique
dure: 1 an
a pour matière: Français
a pour matière: Géographie
a pour matière: Histoire
a pour matière: Histoire de l'Art
a pour matière: Sciences de la Vie
a pour matière: Mathématiques
a pour matière: Education musicale
a pour matière: Education physique
a pour matière: Physique

Classe de 3ème
type: NamedIndividual
type: 3ème
description: Instance de la classe Period3 destinée à représenter les connaissances sur la classe de 3e commune.
est directement suivi par: Classe de seconde générale
est directement suivi par: 2eme Professionnelle
est directement suivi par: 2eme Technologique
dure: 1 an
a pour matière: Français
a pour matière: Géographie
a pour matière: Histoire
a pour matière: Histoire de l'Art
a pour matière: Sciences de la Vie
a pour matière: Mathématiques
a pour matière: Education musicale
a pour matière: Education physique
a pour matière: Physique

Classe de 4ème
type: NamedIndividual
type: 4ème
description: Instance de la classe Period4 destinée à représenter les connaissances sur la classe de 4e commune.
est directement suivi par: Classe de 3ème
dure: 1 an
a pour matière: Français
a pour matière: Géographie
a pour matière: Histoire
a pour matière: Histoire de l'Art
a pour matière: Sciences de la Vie
a pour matière: Mathématiques
a pour matière: Education musicale
a pour matière: Education physique
a pour matière: Physique

Classe de 5ème
type: NamedIndividual
type: 5ème
description: Instance de la classe Period5 destinée à représenter les connaissances sur la classe de 5e commune.
est directement suivi par: Classe de 4ème
dure: 1 an
a pour matière: Français
a pour matière: Géographie
a pour matière: Histoire
a pour matière: Histoire de l'Art
a pour matière: Sciences de la Vie
a pour matière: Mathématiques
a pour matière: Education musicale
a pour matière: Education physique
a pour matière: Physique

Classe de 6ème
type: NamedIndividual
type: 6ème
description: Instance de la classe Period6 destinée à représenter les connaissances sur la classe de 6e commune.
est directement suivi par: Classe de 5ème
dure: 1 an
a pour matière: Français
a pour matière: Géographie
a pour matière: Histoire
a pour matière: Histoire de l'Art
a pour matière: Sciences de la Vie
a pour matière: Mathématiques
a pour matière: Education musicale
a pour matière: Education physique
a pour matière: Physique

Flilière générale
type: NamedIndividual
type: Filière
description: Indique qu'un élément concerne une brache de formation générale.
description: Indique qu'un élément concerne une branche de formation générale

Filière professionnelle
type: NamedIndividual
type: Filière
description: Indique qu'un élément concerne une branche de formation professionnelle

Filière technologique
type: NamedIndividual
type: Filière
description: Indique qu'un élément concerne une brache de formation technologique.
description: Indique qu'un élément concerne une branche de formation technologique

CE1 (cours élémentaire 1)
type: NamedIndividual
type: CE1
description: Instance de la classe PeriodCE1 destinée à représenter les connaissances sur la classe de CE1 commune.
est directement suivi par: CE2 (cours élémentaire 2)
dure: 1 an

CE2 (cours élémentaire 2)
type: NamedIndividual
type: CE2
description: Instance de la classe PeriodCE2 destinée à représenter les connaissances sur la classe de CE2 commune.
est directement suivi par: CM1 (cours moyen 1)
dure: 1 an

CM1 (cours moyen 1)
type: NamedIndividual
type: CM1
description: Instance de la classe PeriodCM1 destinée à représenter les connaissances sur la classe de CM1 commune.
est directement suivi par: CM2 (cours moyen 2)
dure: 1 an

CM2 (cours moyen 2)
type: NamedIndividual
type: CM2
description: Instance de la classe PeriodCM2 destinée à représenter les connaissances sur la classe de CM2 commune.
est directement suivi par: Classe de 6ème
dure: 1 an

CP (cours préparatoire)
type: NamedIndividual
type: CP
description: Instance de la classe PeriodCP destinée à représenter les connaissances sur la classe de CP commune.
est directement suivi par: CE1 (cours élémentaire 1)
dure: 1 an

1 an
type: NamedIndividual
type: Durée
comment: Exprime qu'une chose dure un an (12 mois)

Français
type: NamedIndividual
type: Matière
label: French @en

Géographie
type: NamedIndividual
type: Matière
label: Geography @en

Histoire
type: NamedIndividual
type: Matière
label: History @en

Histoire de l'Art
type: NamedIndividual
type: Matière
label: History of Art @en

Sciences de la Vie
type: NamedIndividual
type: Matière
label: Life sciences @en

Mathématiques
type: NamedIndividual
type: Matière
label: Mathematics @en

Education musicale
type: NamedIndividual
type: Matière

Education physique
type: NamedIndividual
type: Matière
label: Physical education @en

Physique
type: NamedIndividual
type: Matière
label: Physics @en

Terminale générale
type: NamedIndividual
type: Terminale
description: Instance de la classe PeriodTerminal destinée à représenter les connaissances sur la classe de terminale générale.
a pour filière: Flilière générale
dure: 1 an
a pour matière: Français
a pour matière: Géographie
a pour matière: Histoire
a pour matière: Histoire de l'Art
a pour matière: Sciences de la Vie
a pour matière: Mathématiques
a pour matière: Education musicale
a pour matière: Education physique
a pour matière: Physique

terminaleProfessionelle
type: NamedIndividual
type: Terminale
description: Instance de la classe PeriodTerminal destinée à représenter les connaissances sur la classe de terminale professionelle.
est directement précédé par: Première professionnelle
a pour filière: Filière professionnelle
dure: 1 an
a pour matière: Français
a pour matière: Géographie
a pour matière: Histoire
a pour matière: Histoire de l'Art
a pour matière: Sciences de la Vie
a pour matière: Mathématiques
a pour matière: Education musicale
a pour matière: Education physique
a pour matière: Physique

Terminale technologique
type: NamedIndividual
type: Terminale
description: Instance de la classe PeriodTerminal destinée à représenter les connaissances sur la classe de terminale technologiquee.
est directement précédé par: Première technologique
a pour filière: Filière technologique
dure: 1 an
a pour matière: Français
a pour matière: Géographie
a pour matière: Histoire
a pour matière: Histoire de l'Art
a pour matière: Sciences de la Vie
a pour matière: Mathématiques
a pour matière: Education musicale
a pour matière: Education physique
a pour matière: Physique