a pour approche pédagogique
type: ObjectProperty
comment: Associe une séqunece pédagogique avec une approche pédagogique pour cette séquence
range: Démarche
domain: Description de programme

a une description de capacité selon Bloom
type: ObjectProperty
comment: a une description de capacité à acquérir selon la catégorisation de Bloom
range: Bloom Taxonomy
domain: Compétence
sub property of: a pour description

a un commentaire:
type: ObjectProperty
range: Commentaire
domain: Description de programme

a pour objectif d'acquérir la compétence de
type: ObjectProperty
range: Compétence
domain: Description de programme

a pour description
type: ObjectProperty

Premier segment
type: ObjectProperty
comment: Désigne le premier segment descriptif dans une description de programme
range: Restriction
  on property: Premier segment
  on class: Description de programme
  max qualified cardinality: 1
domain: Class
  union of: Description de programme
  union of: Programme d'une matière pour un niveau

a pour mot-clé
type: ObjectProperty
comment: Relie une chose et un mot-clé qui la caractérise
range: Mot-clé
domain: Thing

doit permettre d'acquérir les connaissances suivantes
type: ObjectProperty
range: Connaissance
sub property of: topObjectProperty

Segment suivant
type: ObjectProperty
comment: Désigne le segment suivant d'une segment de description d'un programme
domain: Description de programme
range: Description de programme

fait référence à
type: ObjectProperty
comment: Associe une chose à une référence qui concerne cette chose
domain: Description de programme
range: Référence

a une description d'un segment de programme
type: ObjectProperty
range: Description de programme
domain: Description de programme
sub property of: a pour description

a pour description
type: ObjectProperty
range: Description de programme
domain: Description de programme

a pour sous-thème
type: ObjectProperty
comment: Permet d'associer un théme ou une description à un thème qu'il contient
domain: Description de programme
range: Thème
sub property of: a pour description

concerne
type: ObjectProperty
label: has topic @en
comment: permet de désigner l'objet sur lequel s'applique une action pour définir une compétence
range: Restriction
  on property: concerne
  on class: Sujet
  min qualified cardinality: 1

appartient au parcours pédagogique
type: ObjectProperty
label: belongs to an educational pathway @en
domain: Programme
range: EducationalPathway

directement contenu dans le parcours pédagogque
type: ObjectProperty
sub property of: appartient au parcours pédagogique

est un mot-clé pour
type: ObjectProperty
comment: Relie un mot-clé a une chose dont il est un caractère
domain: Mot-clé
inverse of: a pour mot-clé
range: Thing

hasDBType
type: DatatypeProperty
comment: était la propriété Type définie par Mahdi, mais qui semblait en conflit avec un Type défini ailleurs
domain: Entité nommée
range: string

hasInstance
type: DatatypeProperty
comment: utilisé pour stocker l'instance spécifique d'un verbe de Bloom trouvée dans des données par exemple, sur la phrase en expliquant le lien entre ... on aura une référence au verbe expliquer et l'instance expliquant
domain: Bloom Taxonomy
range: string

Démarche
type: Class
label: Approach @en

Commentaire
type: Class
comment: Utilisé pour accueillir un section du programme qui porte un commentaire sur une partie d'un programme: sur ce qui doit être fait, sur la façon dont cela peut ou doit être fait....

Compétence
type: Class
subclass of: Restriction
  on property: a une description de capacité selon Bloom
  on class: Bloom Taxonomy
  min qualified cardinality: 1
subclass of: Restriction
  on property: concerne
  some values from: Sujet
comment: Description d'une compétence à acquérir, généralement décrite par un verbe correspondant à une capacité d'ordre général (ex: décrire) associée à un object sur lequel va porter l'action correspondante (ex: un monument d'Egypte)

Programme
type: Class
label: EducationalProgram @en
subclass of: Restriction
  on property: hasEducationalSubject
  some values from: EducationalSubject
subclass of: Restriction
  on property: hasPeriod
  some values from: EducationalPathway
subclass of: Restriction
  on property: Premier segment
  on class: Description de programme
  max qualified cardinality: 1

Ressource externe
type: Class
comment: Utilisé pour fournir des informations sur une ressource externe au programme qui peut être consultée pour mieux comprendre le programme ou sa mise en application

Goal
type: Class
comment: Objectif

Mot-clé
type: Class
comment: Mot-clé qui peut être attaché à un Topic, un EducationalProgram ou un EducationalSubject

Connaissance
type: Class
comment: Utilisé pour décrire une connaissance associée à une section d'un programme

Entité nommée
type: Class
subclass of: Mot-clé
comment: Sert à décrire des 'entités nommées' au sens donné par le traitement de la langue naturelle: noms de personnes, de lieux, ...

Description de programme
type: Class
subclass of: Restriction
  on property: hasTextualDescription
  some values from: string
subclass of: Restriction
  on property: Segment suivant
  some values from: Description de programme
comment: Utilisé pour contenir la description d'une partie du programme présentant une certaine homogénéité

Programme pour un niveau scolaire (une classe)
type: Class
subclass of: Programme
subclass of: Restriction
  on property: hasPeriod
  on class: EducationalLevel
  qualified cardinality: 1

Matière
type: Class
subclass of: Programme

Programme d'une matière pour un niveau
type: Class
subclass of: Programme pour un niveau scolaire (une classe)
subclass of: Matière

Question
type: Class
comment: Question à aborder

Référence
type: Class
comment: Utilisé pour représenter un document ou une source d'information externe qui parait utile au regard du contenu d'une section d'un programme. Par exemple, correspond aux sections 'documents de référence' des programmes d'éducation civique.

Thème
type: Class
subclass of: Description de programme
subclass of: Restriction
  on property: a pour approche pédagogique
  some values from: Démarche
subclass of: Restriction
  on property: hasQuestion
  some values from: Question
subclass of: Restriction
  on property: a pour objectif d'acquérir la compétence de
  some values from: Compétence
subclass of: Restriction
  on property: fait référence à
  some values from: Référence
subclass of: Restriction
  on property: doit permettre d'acquérir les connaissances suivantes
  some values from: Connaissance
subclass of: Restriction
  on property: a un commentaire:
  some values from: Commentaire
comment: Utilisé pour une représentation des sections d'un programme appelée thème dans plusieurs des matières; en gros, un thème correspond à la description d'un chapitre ou d'un sous-chapitre dans un manuel scolaire

Sujet
type: Class
label: Topic @en
subclass of: Restriction
  on property: hasExternalResource
  some values from: Ressource externe
comment: Topic is a part of Competency phrase (or capacité in French) in the educational program. @en
comment: Topic est une partie de la description d'une capacité à acquérir Dans le programme scolaire français, de nombruses capacités sont exprimées par un verbe, généralement tiré de la nomenclature de Bloom, suivi d'un sujet sur lequel porte le verbe, par exemple: décrire un monument d'Egypte

Filière générale
type: NamedIndividual

Filière professionnelle
type: NamedIndividual

Filière technologique
type: NamedIndividual